BDBM283535 N-((1-amino-5-methylisoquinolion-6-yl)methyl)- 2-((3-(trifluoromethyl)quinolin-6- yl)methyl)isonicotinamide::US10023557, Example 184::US10308637, Example 184
SMILES Cc1c(CNC(=O)c2ccnc(Cc3ccc4ncc(cc4c3)C(F)(F)F)c2)ccc2c(N)nccc12
InChI Key InChIKey=ZNCHUSONBPLTLN-UHFFFAOYSA-N
Data  2 IC50  1 EC50
  Tab Delimited (TSV)   2D SDfile   Computed 3D by Vconf -m prep SDfile
Find this compound or compounds like it in BindingDB:
Activity Spreadsheet -- Enzyme Inhibition Constant Data from BindingDB
Found 1 hit for monomerid = 283535
TargetMitogen-activated protein kinase kinase kinase kinase 1(Homo sapiens (Human))
Lifesci Pharmaceuticals
US Patent
LigandPNGBDBM283535(N-((1-amino-5-methylisoquinolion-6-yl)methyl)- 2-(...)
Affinity DataIC50: <100nM. Assay description: A 10 mM solution of the test compound was made in DMSO. This solution was serially diluted 1:5 in DMSO to yield 2000, 400, 80, 16, 3.2, 0.64, 0.128, ...
Ligand InfoPC cidPC sid
In DepthDetails US Patent